X101 Copies/Blowbacks/Printing-Black & White (Internal)
type: Class
subclass of: RtpnOBk4lRnWigpEBBKYUDQ
definition: Any black & white copies, blowbacks, digital prints from images, printing or reprinting costs billed on a per page basis when that printing is performed in-house and not by an external vendor