Negligent Exposure of Another to Disease or Toxic Substances
type: Class
alternative label: 对他人的疾病或有毒物质的疏忽暴露
subclass of: R8alUnZrt8GVEzHYhh1KTva
subclass of: RCfunX4u69LUQ3gbhckE0oI
definition: Negligent Exposure of Another to Disease or Toxic Substances: The failure to exercise reasonable care in preventing the exposure of another person to a disease or toxic substance, resulting in harm or injury to that person.