Creditor Matrix
type: Class
alternative label: 债权人矩阵
subclass of: R8zijLH2GH0SxOhIdzeDOs3
definition: A Creditor Matrix or Creditor List is a document that lists the names and addresses of all creditors in a bankruptcy or restructuring case.