Author
type: Class
alternative label: 作者
subclass of: R8eT1bTptg5J6ZfnwSUQYpf
subclass of: ROhQrThJyS0l40fB7FDDHU
definition: An Author is a specific type of Role in Document or oasis:role that refers to the individual or entity responsible for creating or originating a written work.