Drug Crimes
type: Class
preferred label: Controlled Substance Crime
alternative label: 毒品犯罪
subclass of: R7u1GstOpfAmZ3mI7yFcbgU
subclass of: RLvhxz3b1k2IU3MaAgeRtF
definition: The violation of laws prohibiting the production, distribution, and/or use of certain controlled substances and the equipment or devices utilized in their preparation and/or use.