Primary Care Negligence
type: Class
alternative label: 初级保健疏忽
subclass of: R7Zbqfhemxs6PR7r2Fk6NeY
definition: Negligence by a primary care physician in providing medical treatment or advice to a patient, resulting in harm or injury to the patient.