Motion to Settle
type: Class
alternative label: 结案动议
subclass of: R8OXAl4XER5P7DRJEzq7Hg7
definition: A Motion to Settle is a legal request made by one party to a lawsuit to resolve the case through a mutually agreed upon settlement, rather than proceeding to trial.