Client Relationship Role
type: Class
alternative label: 客户关系角色
subclass of: RcTA2iQmrtqOnX3WrjJIp8
definition: A lawyer's client relationship role refers to the various capacities in which an attorney interacts with and manages clients on behalf of a law firm. Examples include a billing partner (who oversees billing and invoicing matters), a responsible attorney (who is in charge of managing a specific legal matter), and a relationship attorney (who is in charge of an overall client relationship).