X202 Patent and Trademark Searching and Monitoring
type: Class
subclass of: RK0ttjFyyS0ytN62EJVzSZg
definition: Any searching and monitoring costs, including any monitoring or watch service for a trademark, brand or domain name. Excludes on-line legal research (X111) or discovery/eDiscovery culling and filtering (X302).