Motions in Appellate Courts
type: Class
alternative label: 上诉法院中的动议
subclass of: R79jXpStbWPIClnqZrLu4yP
subclass of: RDmHm8XikjkCUxdyjBkR7Q0
definition: Motions in Appellate Courts are requests made by parties in a higher court seeking a specific action or decision, such as a motion to expedite a case or a motion for summary disposition.