Orthodontics Malpractice
type: Class
alternative label: 正畸医疗事故
subclass of: R8nVhrBlasGIc7jxw1D0vbm
definition: Orthodontics Malpractice refers to a type of medical malpractice claim that arises from negligent or improper orthodontic treatment by a healthcare professional.