Necessity of Trespass
type: Class
alternative label: 侵权必要性
subclass of: RCzs34uEQI9f4cuWp3bQO0P
definition: The Necessity of Trespass is a legal defense in civil litigation that allows a defendant to justify their trespass onto another's property as necessary to prevent a greater harm.