Matter Percentage Shared Expenses
type: Class
alternative label: 事项百分比共享费用
subclass of: RMDZKh0zTn6FdXzpYpbsle
definition: A Matter Percentage Shared Expenses is a type of Engagement Fee Detail that refers to the portion of expenses related to a legal matter that will be shared between the client and the law firm based on a predetermined percentage.