Use Beyond Scope of Permission
type: Class
alternative label: 超出许可范围的使用
subclass of: RCzs34uEQI9f4cuWp3bQO0P
definition: Use Beyond Scope of Permission refers to a defense strategy in civil litigation where the defendant argues that their actions were not in violation of the law because they were within the scope of their authorized permission.