Administration of Housing Programs, Urban Planning, and Community Development Industry
type: Class
alternative label: 住房和城市发展行业
subclass of: RC2P0YZS5Ku67wmSwN4OxWs
hidden label: HUDP
definition: The Administration of Housing Programs, Urban Planning, and Community Development subsector groups government establishments primarily engaged in the administration of housing, urban planning, and community development.