Negligent Exercise of Retained Control
type: Class
alternative label: 保留控制的疏忽行使
subclass of: R85GQaqi3P8fuEDkEpx55YE
subclass of: R9b5fs8QJuliSZYeaJLJU2t
definition: On a multi-employer work site, a person or entity may be civilly liable if it negligently exercised control so as to have "affirmatively contributed in any way" to the injury.