No Default Clause
type: Class
alternative label: 无默认条款
subclass of: RDe0RKU39BlhcyACJW30ZLc
definition: A "No Default Clause" is a provision in a contract that specifies that neither party can be considered in default unless a specific event or condition occurs, as defined in the contract.