Trial Events
type: Class
alternative label: 审判事件
subclass of: R73Uo5x4VyfiOXt6i4R256t
definition: Trial Events refer to the specific events that occur during a trial, such as opening statements, witness testimony, and the receipt of a verdict.