WC410 Fact Witnesses
type: Class
subclass of: R6P7wyMvVTo6CR9AJqe-HSg
definition: Preparing for examination of witness, Interview/meeting with witness, Preparing for cross-examination of witness, Review & analysis of deposition/trial transcripts