Personally Identifiable Information
type: Class
preferred label: PII
subclass of: R8Ov4MbOJULZY0aLe1KoP3Z
definition: Personally Identifiable Information (PII) is any data that can be used to identify, contact, or locate a specific individual. This includes names, addresses, phone numbers, email addresses, social security numbers, and other identifiers that can be linked to a particular person.