Sanctions
type: Class
preferred label: Sanction
alternative label: 制裁
subclass of: RDbz1PVc6y57oOb9jAIl0eN
subclass of: RSRxb9psAJdqf8rppoiYI8
definition: A penalty or punishment imposed by a court or other authority for a violation of a law or rule, typically involving a fine or other restriction on one's rights or freedoms.