Certified Rent Roll Clause
type: Class
alternative label: 认证租金清单条款
subclass of: RDe0RKU39BlhcyACJW30ZLc
definition: A Certified Rent Roll Clause is a provision in a contract that requires the landlord to provide a verified list of current tenants and their corresponding rental rates.