Health Law
type: Class
alternative label: 卫生法
subclass of: RSYBzf149Mi5KE0YtmpUmr
hidden label: HLTH
definition: Law, rules, regulations and other jurisprudence among providers, payers and vendors to the health care industry and its patients; and (2) delivery of health care services; all with an emphasis on operations, regulatory and transactional legal issues.