Arkansas District Court - Polk Cty.
type: Class
subclass of: RDThzy2Xz9Qod9RsXB01ztw
definition: A court located in Polk County, Arkansas that has jurisdiction over certain legal matters within its designated geographic area.