Privacy Claims
type: Class
preferred label: Surveillance Claims
alternative label: 隐私权主张
subclass of: R8jYAnNATrfoBxAtIKpf72X
definition: A Privacy Claim is a civil claim that seeks to protect an individual's right to privacy, including claims related to the unauthorized disclosure of personal information, invasion of privacy, and violations of confidentiality by healthcare providers.