Galician
type: Class
alternative label: 加利西亚语
subclass of: RDOvAHsvY8TKJ1O1orXPM9o
definition: Galician is a written or spoken structured system of communication that consists of grammar and vocabulary, and is a specific language within the context of legal matters.