Approval Representation
type: Class
alternative label: 批准代表
subclass of: R9rCNhUCohkUGbQyd1C3uzz
definition: A representation made by a party in a legal matter that confirms the approval of a particular action or decision, and is supported by legal or other professional frameworks.