Objection to Transfer of Claim
type: Class
alternative label: 抗辩转让债权
subclass of: RxqbetYhPzqR3tJ4vtTbi8
definition: An objection made by a party in a legal proceeding to prevent the transfer of a claim from one party to another.