Oregon Circuit Court - Wheeler County
type: Class
subclass of: RmGrykg1NdiaxO77n1a1lc
definition: Oregon Circuit Court - Wheeler County refers to a specific court within the Oregon Circuit Court system that has jurisdiction over legal matters within Wheeler County.