Washington Superior Court - Skamania County
type: Class
subclass of: RChEjOHUONk1Yp2qm3OHJdc
definition: Washington Superior Court - Skamania County refers to a specific court within the Washington Superior Court system that has jurisdiction over legal matters in Skamania County.