Family Treatment
type: Class
alternative label: 家庭治疗
subclass of: R7p8xRy14cVNnXyHxD92nQk
definition: A type of therapy that is designed to address issues within a family unit, specifically in the context of criminal disposition conditions.