Arson
type: Class
alternative label: 纵火
subclass of: R8ldDGTh6RHzt0IDL7p597U
definition: To unlawfully and intentionally damage, or attempt to damage, any real or personal property by fire or incendiary device