WC340 Expert Discovery
type: Class
subclass of: Rtk9 RnfyT9yacC QKTzn8Q
definition: Preparing expert discovery and deposition notices, Communicating with expert and opposing counsel, Preparing subpoena to secure experts (vocational/ medical/other) appearance at deposition/trial, Discussing deposition strategy, Preparation for and consultation with expert, Reviewing expert documents/records and/or films review, Drafting expert summaries, Preparation for and consultation with expert, Arranging and scheduling Independent Medical Examinations (IME) and Impairment Rating Evaluations (IRE), Review & Analysis of Independent medical examination (IME) & impairment rating evaluation (IRE), Communicating with expert (vocation/medical and other) and obtaining vocational documents