Subject-Matter Jurisdiction
type: Class
alternative label: 管辖权
subclass of: RDIuHPBKs3x9tZ0vRBJ76AI
definition: Subject-Matter Jurisdiction refers to the authority of a court to hear and decide a particular type of legal dispute, based on the subject matter of the case and the laws governing it.