Lithuanian
type: Class
alternative label: 立陶宛语
subclass of: RDOvAHsvY8TKJ1O1orXPM9o
definition: Lithuanian (Language) is a structured system of communication consisting of grammar and vocabulary used in Lithuania and by Lithuanian speakers.