Sedition
type: Class
alternative label: 煽动叛乱
subclass of: R7V9R3w28BDjOd4lLUUrvQ5
definition: Sedition is a crime against the government that involves inciting rebellion or resistance against lawful authority.