Missouri Circuit Court - Vernon County
type: Class
subclass of: RDECjssxw76vdlahxiUTb4L
definition: Missouri Circuit Court - Vernon County refers to a specific court within the Missouri Circuit Court system that has jurisdiction over legal matters within Vernon County.