PA640 Quasi-Judicial Administrative Proceedings - International
type: Class
subclass of: R6iOMiH eTfClsEnn- jWkA
definition: All action associated with completing a quasi-judicial proceeding before an administrative tribunal associated with a Patent Office outside of the home country of the applicant in connection with an application filed under PA500, including Appeals, Oppositions, Interferences and other ex-parte and inter-partes proceedings. Includes collecting evidence, preparing and filing motions, briefs, responses, replies, surreplies, and other documents, attending conferences, depositions, hearings, and other proceedings. Does not include requests for supervisory action ("Petitions" in the U.S.) under PA630. Note that external expenses are included under E100