Achinese
type: Class
alternative label: 阿齐汉语
subclass of: RDOvAHsvY8TKJ1O1orXPM9o
definition: Achinese is a language that belongs to the Austronesian language family and is spoken in the Aceh province of Indonesia.