L630 Processing (NOS)
type: Class
subclass of: RIqMae8AYRo634OG4XtuV0A
definition: "NOS" = Not Otherwise Specified (catch-all, includes the subcategories) Primarily charges on a per GB, per custodian, or a flat/fixed fee basis.