Amharic
type: Class
alternative label: 阿姆哈拉语
subclass of: RDOvAHsvY8TKJ1O1orXPM9o
definition: Amharic is a structured system of communication, consisting of grammar and vocabulary, used in legal matters, specifically referring to the language spoken in Ethiopia and its legal context.