Mississippi Workers Compensation Opinions
type: Class
subclass of: R8A4a837BE2d5AB3c793565b
definition: Mississippi Workers Compensation Opinions are legal decisions made by the Mississippi State Courts regarding workers' compensation cases in Mississippi.