tk_level
type: Class
subclass of: R8ktJqdQifgzEaV2DJkdMZa
subclass of: R9VdnoybnEodiN0EUTedSOz
subclass of: RbP2hC5iPogaZjkx1uaECq
definition: "The level of the timekeeper. A full list of the codes to use can be found in the LEDES Revised Timekeeper Classifications Reference Document available on LEDES.org. "