Texas District Court - Brazoria County
type: Class
subclass of: RDvQuaxSojEqV7COK0FlBTI
definition: A Texas District Court - Brazoria County is a specific court within the Texas District Court system that has jurisdiction over legal matters within Brazoria County.