Event Scheduled
type: Class
alternative label: 已安排事件
subclass of: Rs2T4JXRBzxyj3hNAMRsoT
definition: Event Scheduled refers to the status of an event that has been planned and has a set date and time.