B210 Business Operations
type: Class
subclass of: R8YtvLbmLTbuOrG1Ns7EfIw
definition: Issues related to debtor-in-possession operating in chapter 11 such as employee, vendor, tenant issues and other similar problems