PA130 Document/File Management
type: Class
subclass of: RS489lsfpR7SJTB0tH66wpQ
definition: A narrowly defined task that includes creating and populating document and other databases or filing systems, that does not fit under other task codes below. Includes the planning, design, and overall management of this process. Work of outside vendors in building litigation support databases should be an expense under E100. Calendaring (or "docketing" in the U.S.) should be included under the appropriate task codes below for each matter unless, otherwise instructed by the client.