Pennsylvania Magisterial District Court - Mifflin County
type: Class
subclass of: R70IGZ5XRTshj1E64tVcxJD
definition: A Pennsylvania Magisterial District Court in Mifflin County is a specific court within the Pennsylvania Magisterial District Court system that handles minor criminal offenses, traffic violations, and civil cases involving amounts up to $12,000.