Access Clause
type: Class
alternative label: 访问条款
subclass of: RDe0RKU39BlhcyACJW30ZLc
definition: An Access Clause is a provision in a contract that grants or restricts the right to enter or use a property or facility.