871 IRS-Third Party 26 USC 7609 (PACER NoS)
type: Class
subclass of: RDmQLk7WWZub9xOSlGs2cyB
definition: Action filed under the Internal Revenue Code - Tax Reform Act of 1976 (P.L. 94-455) Third Party